privatepaste.com :: Paste ID 6f86e60a96

Secure & Private Pasting

Paste ID 6f86e60a96

1.
2.
3.
4.
5.
6.
7.
8.
9.
10.
11.
12.
13.
14.
15.
16.
17.
18.
19.
20.
21.
22.
23.
24.
25.
26.
27.
28.
29.
30.
31.
32.
33.
34.
35.
36.
37.
/home/hepha/aur/firefox-kde-opensuse/src/mozilla-release/obj-x86_64-unknown-linux-gnu/_virtualenv/bin/python /home/hepha/aur/firefox-kde-opensuse/src/mozilla-release/toolkit/mozapps/installer/packager.py -DMOZ_GLUE_IN_PROGRAM -DNO_NSPR_10_SUPPORT -DAB_CD=zh-TW -DMOZ_APP_NAME=firefox -DPREF_DIR=defaults/preferences -DMOZ_ENABLE_GNOME_COMPONENT=1 -DMOZ_GTK=1 -DMOZ_NATIVE_NSPR=1 -DMOZ_NATIVE_NSS=1 -DJAREXT= -DMOZ_CHILD_PROCESS_NAME=plugin-container -DMOZ_JSDEBUGGER -DNECKO_WIFI -DDLL_PREFIX=lib -DDLL_SUFFIX=.so -DBIN_SUFFIX= -DBINPATH=bin \ --format omni \ --removals /home/hepha/aur/firefox-kde-opensuse/src/mozilla-release/browser/installer/removed-files.in \ \ \ \ --optimizejars \ \ package-manifest ../../dist ../../dist/firefox \ Error: /home/hepha/aur/firefox-kde-opensuse/src/mozilla-release/obj-x86_64-unknown-linux-gnu/browser/installer/package-manifest:412: Missing file(s): bin/defaults/pref/kde.js Traceback (most recent call last): File "/home/hepha/aur/firefox-kde-opensuse/src/mozilla-release/toolkit/mozapps/installer/packager.py", line 375, in <module> main() File "/home/hepha/aur/firefox-kde-opensuse/src/mozilla-release/toolkit/mozapps/installer/packager.py", line 328, in main copier.add(mozpack.path.join(binpath, 'removed-files'), removals) File "/usr/lib64/python2.7/contextlib.py", line 24, in __exit__ self.gen.next() File "/home/hepha/aur/firefox-kde-opensuse/src/mozilla-release/python/mozbuild/mozpack/errors.py", line 129, in accumulate raise AccumulatedErrors() mozpack.errors.AccumulatedErrors /home/hepha/aur/firefox-kde-opensuse/src/mozilla-release/toolkit/mozapps/installer/packager.mk:617: recipe for target 'stage-package' failed make[5]: *** [stage-package] Error 1 make[5]: Leaving directory '/home/hepha/aur/firefox-kde-opensuse/src/mozilla-release/obj-x86_64-unknown-linux-gnu/browser/installer' /home/hepha/aur/firefox-kde-opensuse/src/mozilla-release/toolkit/mozapps/installer/packager.mk:646: recipe for target 'make-package' failed make[4]: *** [make-package] Error 2 make[4]: Leaving directory '/home/hepha/aur/firefox-kde-opensuse/src/mozilla-release/obj-x86_64-unknown-linux-gnu/browser/installer' /home/hepha/aur/firefox-kde-opensuse/src/mozilla-release/config/rules.mk:690: recipe for target 'default' failed make[3]: *** [default] Error 2 make[3]: Leaving directory '/home/hepha/aur/firefox-kde-opensuse/src/mozilla-release/obj-x86_64-unknown-linux-gnu/browser/installer' /home/hepha/aur/firefox-kde-opensuse/src/mozilla-release/browser/build.mk:9: recipe for target 'package' failed make[2]: *** [package] Error 2 make[2]: Leaving directory '/home/hepha/aur/firefox-kde-opensuse/src/mozilla-release/obj-x86_64-unknown-linux-gnu' /home/hepha/aur/firefox-kde-opensuse/src/mozilla-release/client.mk:210: recipe for target 'profiledbuild' failed make[1]: *** [profiledbuild] Error 2 make[1]: Leaving directory '/home/hepha/aur/firefox-kde-opensuse/src/mozilla-release' client.mk:172: recipe for target 'build' failed make: *** [build] Error 2
/home/hepha/aur/firefox-kde-opensuse/src/mozilla-release/obj-x86_64-unknown-linux-gnu/_virtualenv/bin/python /home/hepha/aur/firefox-kde-opensuse/src/mozilla-release/toolkit/mozapps/installer/packager.py -DMOZ_GLUE_IN_PROGRAM -DNO_NSPR_10_SUPPORT -DAB_CD=zh-TW -DMOZ_APP_NAME=firefox -DPREF_DIR=defaults/preferences -DMOZ_ENABLE_GNOME_COMPONENT=1 -DMOZ_GTK=1 -DMOZ_NATIVE_NSPR=1 -DMOZ_NATIVE_NSS=1 -DJAREXT= -DMOZ_CHILD_PROCESS_NAME=plugin-container -DMOZ_JSDEBUGGER -DNECKO_WIFI -DDLL_PREFIX=lib -DDLL_SUFFIX=.so -DBIN_SUFFIX= -DBINPATH=bin \ --format omni \ --removals /home/hepha/aur/firefox-kde-opensuse/src/mozilla-release/browser/installer/removed-files.in \ \ \ \ --optimizejars \ \ package-manifest ../../dist ../../dist/firefox \ Error: /home/hepha/aur/firefox-kde-opensuse/src/mozilla-release/obj-x86_64-unknown-linux-gnu/browser/installer/package-manifest:412: Missing file(s): bin/defaults/pref/kde.js Traceback (most recent call last): File "/home/hepha/aur/firefox-kde-opensuse/src/mozilla-release/toolkit/mozapps/installer/packager.py", line 375, in <module> main() File "/home/hepha/aur/firefox-kde-opensuse/src/mozilla-release/toolkit/mozapps/installer/packager.py", line 328, in main copier.add(mozpack.path.join(binpath, 'removed-files'), removals) File "/usr/lib64/python2.7/contextlib.py", line 24, in __exit__ self.gen.next() File "/home/hepha/aur/firefox-kde-opensuse/src/mozilla-release/python/mozbuild/mozpack/errors.py", line 129, in accumulate raise AccumulatedErrors() mozpack.errors.AccumulatedErrors /home/hepha/aur/firefox-kde-opensuse/src/mozilla-release/toolkit/mozapps/installer/packager.mk:617: recipe for target 'stage-package' failed make[5]: *** [stage-package] Error 1 make[5]: Leaving directory '/home/hepha/aur/firefox-kde-opensuse/src/mozilla-release/obj-x86_64-unknown-linux-gnu/browser/installer' /home/hepha/aur/firefox-kde-opensuse/src/mozilla-release/toolkit/mozapps/installer/packager.mk:646: recipe for target 'make-package' failed make[4]: *** [make-package] Error 2 make[4]: Leaving directory '/home/hepha/aur/firefox-kde-opensuse/src/mozilla-release/obj-x86_64-unknown-linux-gnu/browser/installer' /home/hepha/aur/firefox-kde-opensuse/src/mozilla-release/config/rules.mk:690: recipe for target 'default' failed make[3]: *** [default] Error 2 make[3]: Leaving directory '/home/hepha/aur/firefox-kde-opensuse/src/mozilla-release/obj-x86_64-unknown-linux-gnu/browser/installer' /home/hepha/aur/firefox-kde-opensuse/src/mozilla-release/browser/build.mk:9: recipe for target 'package' failed make[2]: *** [package] Error 2 make[2]: Leaving directory '/home/hepha/aur/firefox-kde-opensuse/src/mozilla-release/obj-x86_64-unknown-linux-gnu' /home/hepha/aur/firefox-kde-opensuse/src/mozilla-release/client.mk:210: recipe for target 'profiledbuild' failed make[1]: *** [profiledbuild] Error 2 make[1]: Leaving directory '/home/hepha/aur/firefox-kde-opensuse/src/mozilla-release' client.mk:172: recipe for target 'build' failed make: *** [build] Error 2